Target
Kappa-type opioid receptor
Ligand
BDBM50377221
Substrate
Meas. Tech.
ChEMBL_479369 (CHEMBL921652)
EC50
10000±n/a nM
Citation
 McAtee, JJDodson, JWDowdell, SEGirard, GRGoodman, KBHilfiker, MASehon, CASha, DWang, GZWang, NViet, AQZhang, DAiyar, NVBehm, DJCarballo, LHEvans, CAFries, HENagilla, RRoethke, TJXu, XYuan, CCDouglas, SANeeb, MJ Development of potent and selective small-molecule human Urotensin-II antagonists. Bioorg Med Chem Lett 18:3500-3 (2008)  
Target
Name:
Kappa-type opioid receptor
Synonyms:
K-OR-1 Kappa-opioid receptor (KOR) Kappa-type opioid receptor (KOR) OPIATE Kappa OPRK1 kappa opioid receptor (KOR)
Type:
G Protein-Coupled Receptor (GPCR)
Mol. Mass.:
42648.76
Organism:
Homo sapiens (Human)
Description:
P41145
Residue:
380
  
Inhibitor
Name:
BDBM50377221
Synonyms:
CHEMBL402813
Type:
Small organic molecule
Emp. Form.:
C27H35Cl2N3O3
Mol. Mass.:
520.491
SMILES:
COCCN(CC(=O)N1CCCC(C1CN1CCOCC1)c1ccccc1)c1ccc(Cl)c(Cl)c1
: