Target
Urotensin-2 receptor
Ligand
BDBM50377227
Substrate
Meas. Tech.
ChEMBL_479361 (CHEMBL921644)
Ki
1.2±n/a nM
Citation
 McAtee, JJDodson, JWDowdell, SEGirard, GRGoodman, KBHilfiker, MASehon, CASha, DWang, GZWang, NViet, AQZhang, DAiyar, NVBehm, DJCarballo, LHEvans, CAFries, HENagilla, RRoethke, TJXu, XYuan, CCDouglas, SANeeb, MJ Development of potent and selective small-molecule human Urotensin-II antagonists. Bioorg Med Chem Lett 18:3500-3 (2008)  
Target
Name:
Urotensin-2 receptor
Synonyms:
G-protein coupled receptor 14 UR-II-R UTS2R Urotensin-II
Type:
Enzyme Catalytic Domain
Mol. Mass.:
42159.71
Organism:
Homo sapiens (Human)
Description:
Urotensin-II UTS2R HUMAN::Q9UKP6
Residue:
389
  
Inhibitor
Name:
BDBM50377227
Synonyms:
CHEMBL255462
Type:
Small organic molecule
Emp. Form.:
C25H28ClN3O2S
Mol. Mass.:
470.027
SMILES:
Clc1ccc2sc(=O)n(CC(=O)N3CCCC(C3CN3CCCC3)c3ccccc3)c2c1
: