Target
Glucocorticoid receptor
Ligand
BDBM50377342
Substrate
Meas. Tech.
ChEMBL_479545 (CHEMBL931541)
IC50
>1000±n/a nM
Citation
 Roach, SLHiguchi, RIAdams, MELiu, YKaranewsky, DSMarschke, KBMais, DEMiner, JNZhi, L Discovery of nonsteroidal glucocorticoid receptor ligands based on 6-indole-1,2,3,4-tetrahydroquinolines. Bioorg Med Chem Lett 18:3504-8 (2008)  
Target
Name:
Glucocorticoid receptor
Synonyms:
GCR_HUMAN GRL Glucocorticoid receptor (GRFP) Nuclear receptor subfamily 3 group C member 1
Type:
Enzyme
Mol. Mass.:
85656.87
Organism:
Homo sapiens (Human)
Description:
P04150
Residue:
777
  
Inhibitor
Name:
BDBM50377342
Synonyms:
CHEMBL436848
Type:
Small organic molecule
Emp. Form.:
C21H23ClN2
Mol. Mass.:
338.874
SMILES:
CC1CC(C)(C)Nc2c(C)cc(-c3cc4ccccc4[nH]3)c(Cl)c12
: