Target
Glucocorticoid receptor
Ligand
BDBM50377339
Substrate
Meas. Tech.
ChEMBL_479547 (CHEMBL931543)
IC50
>1000±n/a nM
Citation
 Roach, SLHiguchi, RIAdams, MELiu, YKaranewsky, DSMarschke, KBMais, DEMiner, JNZhi, L Discovery of nonsteroidal glucocorticoid receptor ligands based on 6-indole-1,2,3,4-tetrahydroquinolines. Bioorg Med Chem Lett 18:3504-8 (2008)  
Target
Name:
Glucocorticoid receptor
Synonyms:
GCR_HUMAN GRL Glucocorticoid receptor (GRFP) Nuclear receptor subfamily 3 group C member 1
Type:
Enzyme
Mol. Mass.:
85656.87
Organism:
Homo sapiens (Human)
Description:
P04150
Residue:
777
  
Inhibitor
Name:
BDBM50377339
Synonyms:
CHEMBL404879
Type:
Small organic molecule
Emp. Form.:
C21H22Cl2N2
Mol. Mass.:
373.319
SMILES:
CC1CC(C)(C)Nc2c(C)cc(c(Cl)c12)-c1ccc(Cl)c2cc[nH]c12
: