Target
Thrombopoietin receptor
Ligand
BDBM50219647
Substrate
Meas. Tech.
ChEMBL_479602 (CHEMBL926798)
EC50
>10000±n/a nM
Citation
 Reiter, LAJones, CSBrissette, WHMcCurdy, SPAbramov, YABordner, JDiCapua, FMMunchhof, MJRescek, DMSamardjiev, IJWithka, JM Molecular features crucial to the activity of pyrimidine benzamide-based thrombopoietin receptor agonists. Bioorg Med Chem Lett 18:3000-6 (2008)  
Target
Name:
Thrombopoietin receptor
Synonyms:
C-mpl MPL TPO-R TPOR_HUMAN
Type:
PROTEIN
Mol. Mass.:
71243.48
Organism:
Homo sapiens (Human)
Description:
ChEMBL_535587
Residue:
635
  
Inhibitor
Name:
BDBM50219647
Synonyms:
4-(pyrimidin-4-ylamino)-N-(4-(2-(trifluoromethyl)phenyl)thiazol-2-yl)benzamide | CHEMBL246616
Type:
Small organic molecule
Emp. Form.:
C21H14F3N5OS
Mol. Mass.:
441.429
SMILES:
FC(F)(F)c1ccccc1-c1csc(NC(=O)c2ccc(Nc3ccncn3)cc2)n1
: