Target
Thrombopoietin receptor
Ligand
BDBM50219632
Substrate
Meas. Tech.
ChEMBL_479602 (CHEMBL926798)
EC50
230±n/a nM
Citation
 Reiter, LAJones, CSBrissette, WHMcCurdy, SPAbramov, YABordner, JDiCapua, FMMunchhof, MJRescek, DMSamardjiev, IJWithka, JM Molecular features crucial to the activity of pyrimidine benzamide-based thrombopoietin receptor agonists. Bioorg Med Chem Lett 18:3000-6 (2008)  
Target
Name:
Thrombopoietin receptor
Synonyms:
C-mpl MPL TPO-R TPOR_HUMAN
Type:
PROTEIN
Mol. Mass.:
71243.48
Organism:
Homo sapiens (Human)
Description:
ChEMBL_535587
Residue:
635
  
Inhibitor
Name:
BDBM50219632
Synonyms:
CHEMBL393268 | N-(4-(4-chloro-2-fluorophenyl)thiazol-2-yl)-4-(pyrimidin-4-ylamino)benzamide
Type:
Small organic molecule
Emp. Form.:
C20H13ClFN5OS
Mol. Mass.:
425.867
SMILES:
Fc1cc(Cl)ccc1-c1csc(NC(=O)c2ccc(Nc3ccncn3)cc2)n1
: