Target
Adenosine receptor A2a
Ligand
BDBM50377450
Substrate
Meas. Tech.
ChEMBL_479701 (CHEMBL933565)
Ki
49±n/a nM
Citation
 Gillespie, RJAdams, DRBebbington, DBenwell, KCliffe, IADawson, CEDourish, CTFletcher, AGaur, SGiles, PRJordan, AMKnight, ARKnutsen, LJLawrence, ALerpiniere, JMisra, APorter, RHPratt, RMShepherd, RUpton, RWard, SEWeiss, SMWilliamson, DS Antagonists of the human adenosine A2A receptor. Part 1: Discovery and synthesis of thieno[3,2-d]pyrimidine-4-methanone derivatives. Bioorg Med Chem Lett 18:2916-9 (2008)  
Target
Name:
Adenosine receptor A2a
Synonyms:
A2A adenosine receptor (hA2A) ADENOSINE A2 ADORA2 Adenosine A2A receptor (A2AAR)
Type:
G Protein-Coupled Receptor (GPCR)
Mol. Mass.:
44716.46
Organism:
Homo sapiens (Human)
Description:
P29274
Residue:
412
  
Inhibitor
Name:
BDBM50377450
Synonyms:
CHEMBL264436
Type:
Small organic molecule
Emp. Form.:
C13H11N3OS2
Mol. Mass.:
289.376
SMILES:
CN(C)c1nc(C(=O)c2cccs2)c2sccc2n1
: