Target
Adenosine receptor A1
Ligand
BDBM50377471
Substrate
Meas. Tech.
ChEMBL_479700 (CHEMBL933564)
Ki
3474±n/a nM
Citation
 Gillespie, RJAdams, DRBebbington, DBenwell, KCliffe, IADawson, CEDourish, CTFletcher, AGaur, SGiles, PRJordan, AMKnight, ARKnutsen, LJLawrence, ALerpiniere, JMisra, APorter, RHPratt, RMShepherd, RUpton, RWard, SEWeiss, SMWilliamson, DS Antagonists of the human adenosine A2A receptor. Part 1: Discovery and synthesis of thieno[3,2-d]pyrimidine-4-methanone derivatives. Bioorg Med Chem Lett 18:2916-9 (2008)  
Target
Name:
Adenosine receptor A1
Synonyms:
A1 adenosine receptor (hA1) AA1R_HUMAN ADORA1 Adenosine A1-receptor Adenosine receptor A1 (hA1) | Adenosine transporter (AdT)
Type:
G Protein-Coupled Receptor (GPCR)
Mol. Mass.:
36520.92
Organism:
Homo sapiens (Human)
Description:
P30542
Residue:
326
  
Inhibitor
Name:
BDBM50377471
Synonyms:
CHEMBL411922
Type:
Small organic molecule
Emp. Form.:
C12H6F3N3OS
Mol. Mass.:
297.256
SMILES:
FC(F)(F)c1nc(C(=O)c2ccc[nH]2)c2sccc2n1
: