Target
Prothrombin
Ligand
BDBM50377622
Substrate
Meas. Tech.
ChEMBL_479759 (CHEMBL934691)
Ki
1.2±n/a nM
Citation
 Kreutter, KDLu, TLee, LGiardino, ECPatel, SHuang, HXu, GFitzgerald, MHaertlein, BJMohan, VCrysler, CEisennagel, SDasgupta, MMcMillan, MSpurlino, JCHuebert, NDMaryanoff, BETomczuk, BEDamiano, BPPlayer, MR Orally efficacious thrombin inhibitors with cyanofluorophenylacetamide as the P2 motif. Bioorg Med Chem Lett 18:2865-70 (2008)  
Target
Name:
Prothrombin
Synonyms:
Activation peptide fragment 1 Coagulation factor II Prothrombin precursor Thrombin heavy chain | Thrombin light chain
Type:
Protein
Mol. Mass.:
70029.57
Organism:
Homo sapiens (Human)
Description:
P00734
Residue:
622
  
Inhibitor
Name:
BDBM50377622
Synonyms:
CHEMBL257543
Type:
Small organic molecule
Emp. Form.:
C19H20F3N7O2
Mol. Mass.:
435.403
SMILES:
NC(=N)NOCCNC(=O)Cc1c(F)c(NCC(F)(F)c2ccccn2)ccc1C#N
: