Target
RAF proto-oncogene serine/threonine-protein kinase
Ligand
BDBM50377766
Substrate
Meas. Tech.
ChEMBL_480033 (CHEMBL927975)
IC50
1±n/a nM
Citation
 Wolin, RLBembenek, SDWei, JCrawford, SLundeen, KBrunmark, AKarlsson, LEdwards, JPBlevitt, JM Dual binding site inhibitors of B-RAF kinase. Bioorg Med Chem Lett 18:2825-9 (2008)  
Target
Name:
RAF proto-oncogene serine/threonine-protein kinase
Synonyms:
C-Raf Protein Kinase RAF RAF1 Raf-1 Serine/threonine-protein kinase C-Raf | cRaf
Type:
Serine/threonine-protein kinase
Mol. Mass.:
73082.52
Organism:
Homo sapiens (Human)
Description:
P04049
Residue:
648
  
Inhibitor
Name:
BDBM50377766
Synonyms:
CHEMBL403854
Type:
Small organic molecule
Emp. Form.:
C25H23ClN6O
Mol. Mass.:
458.943
SMILES:
CNc1nccc(n1)-c1nc([nH]c1-c1cccc(NC(=O)Cc2ccc(Cl)cc2)c1)C1CC1
: