Target
Tyrosine-protein phosphatase non-receptor type 22
Ligand
BDBM50117
Substrate
Meas. Tech.
ChEMBL_480038 (CHEMBL927977)
IC50
980±n/a nM
Citation
 Xie, YLiu, YGong, GRinderspacher, ADeng, SXSmith, DHToebben, UTzilianos, EBranden, LVidovic, DChung, CSchürer, STautz, LLandry, DW Discovery of a novel submicromolar inhibitor of the lymphoid specific tyrosine phosphatase. Bioorg Med Chem Lett 18:2840-4 (2008)  
Target
Name:
Tyrosine-protein phosphatase non-receptor type 22
Synonyms:
3.1.3.48 LyP Lymphoid phosphatase (Lyp) PEST-domain phosphatase PTPN22 Tyrosine-protein phosphatase non-receptor type 22 (LYP) | tyrosine-protein phosphatase non-receptor type 22 isoform 1
Type:
Mol. Mass.:
91712.31
Organism:
Homo sapiens (Human)
Description:
Q9Y2R2
Residue:
807
  
Inhibitor
Name:
BDBM50117
Synonyms:
3-[(5E)-5-[[5-(1,3-benzothiazol-2-yl)-2-furanyl]methylidene]-4-oxo-2-sulfanylidene-3-thiazolidinyl]propanoic acid 3-[(5E)-5-[[5-(1,3-benzothiazol-2-yl)furan-2-yl]methylidene]-4-oxidanylidene-2-sulfanylidene-1,3-thiazolidin-3-yl]propanoic acid CHEMBL403994 SMR000154093 | cid_2030970
Type:
Small organic molecule
Emp. Form.:
C18H12N2O4S3
Mol. Mass.:
416.494
SMILES:
OC(=O)CCN1C(=S)S\C(=C\c2ccc(o2)-c2nc3ccccc3s2)C1=O
: