Target
Glutamate receptor ionotropic, NMDA 2B
Ligand
BDBM50377829
Substrate
Meas. Tech.
ChEMBL_480054 (CHEMBL933576)
Ki
248±n/a nM
Citation
 Alarcon, KMartz, AMony, LNeyton, JPaoletti, PGoeldner, MFoucaud, B Reactive derivatives for affinity labeling in the ifenprodil site of NMDA receptors. Bioorg Med Chem Lett 18:2765-70 (2008)  
Target
Name:
Glutamate receptor ionotropic, NMDA 2B
Synonyms:
GluN2B Grin2b NMDA receptor subunit N2B (GluN2B) NMDE2_RAT | NR2B
Type:
Protein
Mol. Mass.:
166077.66
Organism:
Rattus norvegicus (Rat)
Description:
Q00960
Residue:
1482
  
Inhibitor
Name:
BDBM50377829
Synonyms:
CHEMBL255895
Type:
Small organic molecule
Emp. Form.:
C22H24N2O3
Mol. Mass.:
364.4376
SMILES:
[O-][N+](=O)c1ccc(cc1)C(=O)C(=C)CN1CCC(Cc2ccccc2)CC1
: