Target
11-beta-hydroxysteroid dehydrogenase 1
Ligand
BDBM50377885
Substrate
Meas. Tech.
ChEMBL_480088 (CHEMBL934813)
IC50
8±n/a nM
Citation
 Zhu, YOlson, SHGraham, DPatel, GHermanowski-Vosatka, AMundt, SShah, KSpringer, MThieringer, RWright, SXiao, JZokian, HDragovic, JBalkovec, JM Phenylcyclobutyl triazoles as selective inhibitors of 11beta-hydroxysteroid dehydrogenase type I. Bioorg Med Chem Lett 18:3412-6 (2008)  
Target
Name:
11-beta-hydroxysteroid dehydrogenase 1
Synonyms:
11-DH 11-beta-Hydroxysteroid Dehydrogenase 1 (11-beta-HSD1) 11-beta-hydroxysteroid dehydrogenase 1 (11HSD1) Corticosteroid 11-beta-dehydrogenase isozyme 1 (11-beta-HSD-1) Corticosteroid 11-beta-dehydrogenase isozyme 1 (11beta-HSD1) HSD11 HSD11L | SDR26C1
Type:
Enzyme
Mol. Mass.:
32409.16
Organism:
Homo sapiens (Human)
Description:
P28845
Residue:
292
  
Inhibitor
Name:
BDBM50377885
Synonyms:
CHEMBL402995
Type:
Small organic molecule
Emp. Form.:
C17H21N3
Mol. Mass.:
267.3687
SMILES:
C1CC1(c1nnc2CCCCCCn12)c1ccccc1
: