Target
Gonadotropin-releasing hormone receptor
Ligand
BDBM50377900
Substrate
Meas. Tech.
ChEMBL_480123 (CHEMBL923765)
Ki
0.61±n/a nM
Citation
 Zhao, LGuo, ZChen, YHu, TWu, DZhu, YFRowbottom, MGross, TDTucci, FCStruthers, RSXie, QChen, C 5-Aryluracils as potent GnRH antagonists-Characterization of atropisomers. Bioorg Med Chem Lett 18:3344-9 (2008)  
Target
Name:
Gonadotropin-releasing hormone receptor
Synonyms:
GNRHR GRHR GnRH-R Gonadotropin-releasing hormone receptor | Gonadotropin-releasing hormone receptor (GnRH)
Type:
Enzyme
Mol. Mass.:
37749.45
Organism:
Homo sapiens (Human)
Description:
P30968
Residue:
328
  
Inhibitor
Name:
BDBM50377900
Synonyms:
CHEMBL259906
Type:
Small organic molecule
Emp. Form.:
C28H30F5N3O3
Mol. Mass.:
551.5481
SMILES:
COc1cccc(c1F)-c1c(C)n(Cc2c(F)cccc2C(F)(F)F)c(=O)n(C[C@H](C)NC2CCCC2)c1=O
: