Target
Prostaglandin G/H synthase 2
Ligand
BDBM50377905
Substrate
Meas. Tech.
ChEMBL_551369 (CHEMBL1008495)
IC50
600±n/a nM
Citation
 Larsson, JGottfries, JBohlin, LBacklund, A Expanding the ChemGPS chemical space with natural products. J Nat Prod 68:985-91 (2005)  
Target
Name:
Prostaglandin G/H synthase 2
Synonyms:
COX2 Cyclooxygenase 2 (COX-2) Cyclooxygenase-2 (COX-2 AA) Cyclooxygenase-2 (COX-2) PGH2_HUMAN PHS II Prostaglandin E synthase/G/H synthase 2 Prostaglandin-endoperoxide synthase 2
Type:
Enzyme
Mol. Mass.:
69003.89
Organism:
Homo sapiens (Human)
Description:
Recombinant Cox-2 provided by Cayman (Cayman Chemical Co.,Ann Arbor, MI).
Residue:
604
  
Inhibitor
Name:
BDBM50377905
Synonyms:
ENHYDRIN
Type:
Small organic molecule
Emp. Form.:
C23H28O10
Mol. Mass.:
464.4624
SMILES:
COC(=O)C1=CCC[C@@]2(C)O[C@@H]2[C@H]2OC(=O)C(=C)[C@@H]2[C@H](OC(=O)[C@@]2(C)O[C@H]2C)[C@H]1OC(C)=O
: