Target
Ryanodine receptor 1
Ligand
BDBM50191286
Substrate
Meas. Tech.
ChEMBL_503194 (CHEMBL990317)
EC50
2000±n/a nM
Citation
 Franklin, MAPenn, SGLebrilla, CBLam, THPessah, INMolinski, TF Bastadin 20 and bastadin O-sulfate esters from Ianthella basta: novel modulators of the Ry1R FKBP12 receptor complex. J Nat Prod 59:1121-7 (1997)  
Target
Name:
Ryanodine receptor 1
Synonyms:
RYR-1 RYR1_RABIT Skeletal muscle ryanodine receptor Type 1 ryanodine receptor
Type:
PROTEIN
Mol. Mass.:
565099.26
Organism:
Oryctolagus cuniculus
Description:
ChEMBL_19634
Residue:
5037
  
Inhibitor
Name:
BDBM50191286
Synonyms:
Bastadin-5 bastadin 5
Type:
Small organic molecule
Emp. Form.:
C34H27Br5N4O8
Mol. Mass.:
1019.12
SMILES:
Oc1c(Br)cc2CCNC(=O)C(Cc3cc(Br)c(Oc4cc(CC(N=O)C(=O)NCCc5ccc(Oc1c2)c(Br)c5)cc(Br)c4O)c(Br)c3)N=O
: