Target
Endothelin-1 receptor
Ligand
BDBM50711
Substrate
Meas. Tech.
ChEMBL_486334 (CHEMBL1009563)
IC50
10000±n/a nM
Citation
 Hargreaves, JPark, JOGhisalberti, ELSivasithamparam, KSkelton, BWWhite, AH New chlorinated diphenyl ethers from an Aspergillus species. J Nat Prod 65:7-10 (2002)  
Target
Name:
Endothelin-1 receptor
Synonyms:
EDNRA_RAT Ednra Endothelin-1 receptor
Type:
Enzyme Catalytic Domain
Mol. Mass.:
48256.91
Organism:
RAT
Description:
ENDOTHELIN A EDNRA RAT::P26684
Residue:
426
  
Inhibitor
Name:
BDBM50711
Synonyms:
2-(2-carbomethoxy-4-hydroxy-6-methoxy-phenoxy)-6-hydroxy-4-methyl-benzoic acid 2-hydroxy-6-(4-hydroxy-2-methoxy-6-methoxycarbonylphenoxy)-4-methylbenzoic acid MLS000863583 cid_3080568
Type:
Small organic molecule
Emp. Form.:
C17H16O8
Mol. Mass.:
348.3041
SMILES:
COC(=O)c1cc(O)cc(OC)c1Oc1cc(C)cc(O)c1C(O)=O
: