Target
Prostaglandin G/H synthase 1
Ligand
BDBM50135167
Substrate
Meas. Tech.
ChEMBL_481469 (CHEMBL995702)
IC50
12800±n/a nM
Citation
 Szewczuk, LMPenning, TM Mechanism-based inactivation of COX-1 by red wine m-hydroquinones: a structure-activity relationship study. J Nat Prod 67:1777-82 (2004)  
Target
Name:
Prostaglandin G/H synthase 1
Synonyms:
COX1 Cyclooxygenase-1 (COX-1) PTGS1 | Prostaglandin G/H synthase (cyclooxygenase)
Type:
Protein
Mol. Mass.:
68868.60
Organism:
Ovis aries (Sheep)
Description:
Residue:
600
  
Inhibitor
Name:
BDBM50135167
Synonyms:
(+)-epicatechin (2S,3S)-2-(3,4-Dihydroxy-phenyl)-chroman-3,5,7-triol Epicatechin
Type:
Small organic molecule
Emp. Form.:
C15H14O6
Mol. Mass.:
290.2681
SMILES:
O[C@H]1Cc2c(O)cc(O)cc2O[C@H]1c1ccc(O)c(O)c1
: