Target
Receptor-type tyrosine-protein kinase FLT3
Ligand
BDBM16673
Substrate
Meas. Tech.
ChEMBL_531135 (CHEMBL974021)
Kd
20±n/a nM
Citation
 McDermott, USharma, SVDowell, LGreninger, PMontagut, CLamb, JArchibald, HRaudales, RTam, ALee, DRothenberg, SMSupko, JGSordella, RUlkus, LEIafrate, AJMaheswaran, SNjauw, CNTsao, HDrew, LHanke, JHMa, XJErlander, MGGray, NSHaber, DASettleman, J Identification of genotype-correlated sensitivity to selective kinase inhibitors by using high-throughput tumor cell line profiling. Proc Natl Acad Sci U S A 104:19936-41 (2007)  
Target
Name:
Receptor-type tyrosine-protein kinase FLT3
Synonyms:
CD135 FL cytokine receptor FLK2 FLT3 Fetal liver kinase-2 Fms-like tyrosine kinase 3 (Flt-3) STK-1 Stem cell tyrosine kinase 1
Type:
Enzyme
Mol. Mass.:
112888.62
Organism:
Homo sapiens (Human)
Description:
P36888
Residue:
993
  
Inhibitor
Name:
BDBM16673
Synonyms:
4-[4-({[4-chloro-3-(trifluoromethyl)phenyl]carbamoyl}amino)phenoxy]-N-methylpyridine-2-carboxamide BAY 43-9006 BAY439006 Hit compound, 8 Sorafenib US10183928, Sorafenib US10227329, Compound Sorafenib US10774070, Compound Sorafenib US11279688, Compound Sorafenib US9029401, Sorafenib US9902709, Comparative example 1 cid_216239
Type:
Small organic molecule
Emp. Form.:
C21H16ClF3N4O3
Mol. Mass.:
464.825
SMILES:
CNC(=O)c1cc(Oc2ccc(NC(=O)Nc3ccc(Cl)c(c3)C(F)(F)F)cc2)ccn1
: