Target
Epidermal growth factor receptor
Ligand
BDBM4566
Substrate
Meas. Tech.
ChEMBL_531098 (CHEMBL976906)
EC50
50±n/a nM
Citation
 McDermott, USharma, SVDowell, LGreninger, PMontagut, CLamb, JArchibald, HRaudales, RTam, ALee, DRothenberg, SMSupko, JGSordella, RUlkus, LEIafrate, AJMaheswaran, SNjauw, CNTsao, HDrew, LHanke, JHMa, XJErlander, MGGray, NSHaber, DASettleman, J Identification of genotype-correlated sensitivity to selective kinase inhibitors by using high-throughput tumor cell line profiling. Proc Natl Acad Sci U S A 104:19936-41 (2007)  
Target
Name:
Epidermal growth factor receptor
Synonyms:
EGF Receptor Substrate EGFR_HUMAN ERBB1 Epidermal Growth Factor Receptor erbB-1 Epidermal growth factor receptor (EGFR) HER1 Proto-oncogene c-ErbB-1 Tyrosine-Protein Kinase ErbB-1
Type:
Receptor Kinase Domain
Mol. Mass.:
134279.59
Organism:
Homo sapiens (Human)
Description:
P00533
Residue:
1210
  
Inhibitor
Name:
BDBM4566
Synonyms:
4-anilinoquinazoline deriv. 1 N-{4-[(3-bromophenyl)amino]quinazolin-6-yl}but-2-ynamide
Type:
Small organic molecule
Emp. Form.:
C18H13BrN4O
Mol. Mass.:
381.226
SMILES:
CC#CC(=O)Nc1ccc2ncnc(Nc3cccc(Br)c3)c2c1
: