Target
Cannabinoid receptor 2
Ligand
BDBM50261052
Substrate
Meas. Tech.
ChEMBL_552264 (CHEMBL995594)
Ki
7±n/a nM
Citation
 Omura, HKawai, MShima, AIwata, YIto, FMasuda, TOhta, AMakita, NOmoto, KSugimoto, HKikuchi, AIwata, HAndo, K The SAR studies of novel CB2 selective agonists, benzimidazolone derivatives. Bioorg Med Chem Lett 18:3310-4 (2008)  
Target
Name:
Cannabinoid receptor 2
Synonyms:
CANNABINOID CB2 CB2 CB2B CNR2_HUMAN Cannabinoid CB2 receptor Cannabinoid receptor 2 (CB2R) | hCB2
Type:
G Protein-Coupled Receptor (GPCR)
Mol. Mass.:
39690.94
Organism:
Homo sapiens (Human)
Description:
P34972
Residue:
360
  
Inhibitor
Name:
BDBM50261052
Synonyms:
(R)-3-(2-morpholinoethyl)-2-oxo-N-(1,2,3,4-tetrahydronaphthalen-1-yl)-2,3-dihydrobenzo[d]imidazole-1-carboxamide | CHEMBL523708
Type:
Small organic molecule
Emp. Form.:
C24H28N4O3
Mol. Mass.:
420.5041
SMILES:
O=C(N[C@@H]1CCCc2ccccc12)n1c2ccccc2n(CCN2CCOCC2)c1=O
: