Target
5-hydroxytryptamine receptor 1E
Ligand
BDBM50271706
Substrate
Meas. Tech.
ChEMBL_556752 (CHEMBL959815)
Ki
>500±n/a nM
Citation
 Nichols, DEFrescas, SPChemel, BRRehder, KSZhong, DLewin, AH High specific activity tritium-labeled N-(2-methoxybenzyl)-2,5-dimethoxy-4-iodophenethylamine (INBMeO): a high-affinity 5-HT2A receptor-selective agonist radioligand. Bioorg Med Chem 16:6116-23 (2008)  
Target
Name:
5-hydroxytryptamine receptor 1E
Synonyms:
5-HT-1E 5-Hydroxytryptamine Receptor Subtype 1E (5HT1E) 5-hydroxytryptamine receptor 1E (5-HT-1E) (S31) 5HT1E_HUMAN S31 Serotonin 1e (5-HT1e) receptor | Serotonin Receptor 1E
Type:
G Protein-Coupled Receptor (GPCR)
Mol. Mass.:
41697.80
Organism:
Homo sapiens (Human)
Description:
gi_112822
Residue:
365
  
Inhibitor
Name:
BDBM50271706
Synonyms:
CHEMBL482496 | N-(2-[3H-OCH3]benzyl)-2-(2-[3H-OCH3]-5-methoxy-4-iodophenyl)ethylamine
Type:
Small organic molecule
Emp. Form.:
C18H22INO3
Mol. Mass.:
427.2767
SMILES:
COc1ccccc1CNCCc1cc(OC)c(I)cc1OC
: