Target
Acetylcholinesterase
Ligand
BDBM50292569
Substrate
Meas. Tech.
ChEMBL_552464 (CHEMBL1002724)
Ki
1300±n/a nM
Citation
 Butini, SCampiani, GBorriello, MGemma, SPanico, APersico, MCatalanotti, BRos, SBrindisi, MAgnusdei, MFiorini, INacci, VNovellino, EBelinskaya, TSaxena, AFattorusso, C Exploiting protein fluctuations at the active-site gorge of human cholinesterases: further optimization of the design strategy to develop extremely potent inhibitors. J Med Chem 51:3154-70 (2008)  
Target
Name:
Acetylcholinesterase
Synonyms:
ACES_MOUSE Acetylcholinesterase (mouse AChE) Ache
Type:
Enzyme
Mol. Mass.:
68165.65
Organism:
Mus musculus (mouse)
Description:
Residue:
614
  
Inhibitor
Name:
BDBM50292569
Synonyms:
2-[(1Z)-(hydroxyimino)methyl]-1-(7-{2-[(1E)-(hydroxyimino)methyl]pyridin-1-ium-1-yl}heptyl)pyridin-1-ium dichloride | CHEMBL524365
Type:
Small organic molecule
Emp. Form.:
C19H26N4O2
Mol. Mass.:
342.4342
SMILES:
O=NCc1cccc[n+]1CCCCCCC[n+]1ccccc1CN=O
: