Target
Acetylcholinesterase
Ligand
BDBM8962
Substrate
Meas. Tech.
ChEMBL_555815 (CHEMBL965675)
IC50
28±n/a nM
Citation
 Butini, SCampiani, GBorriello, MGemma, SPanico, APersico, MCatalanotti, BRos, SBrindisi, MAgnusdei, MFiorini, INacci, VNovellino, EBelinskaya, TSaxena, AFattorusso, C Exploiting protein fluctuations at the active-site gorge of human cholinesterases: further optimization of the design strategy to develop extremely potent inhibitors. J Med Chem 51:3154-70 (2008)  
Target
Name:
Acetylcholinesterase
Synonyms:
ACES_RAT Acetylcholinesterase and butyrylcholinesterase (AChE and BChE) Acetylcholinesterase, AChE | Ache
Type:
Enzyme
Mol. Mass.:
68193.62
Organism:
Rattus norvegicus (rat)
Description:
P37136
Residue:
614
  
Inhibitor
Name:
BDBM8962
Synonyms:
Bis-THA inhibitor 4 N-[5-(1,2,3,4-tetrahydroacridin-9-ylamino)pentyl]-1,2,3,4-tetrahydroacridin-9-amine | Tacrine Dimer 3a
Type:
Small organic molecule
Emp. Form.:
C31H36N4
Mol. Mass.:
464.6443
SMILES:
C(CCNc1c2CCCCc2nc2ccccc12)CCNc1c2CCCCc2nc2ccccc12
: