Target
Carboxylic ester hydrolase
Ligand
BDBM8962
Substrate
Meas. Tech.
ChEMBL_555816 (CHEMBL965676)
IC50
329±n/a nM
Citation
 Butini, SCampiani, GBorriello, MGemma, SPanico, APersico, MCatalanotti, BRos, SBrindisi, MAgnusdei, MFiorini, INacci, VNovellino, EBelinskaya, TSaxena, AFattorusso, C Exploiting protein fluctuations at the active-site gorge of human cholinesterases: further optimization of the design strategy to develop extremely potent inhibitors. J Med Chem 51:3154-70 (2008)  
Target
Name:
Carboxylic ester hydrolase
Synonyms:
Acetylcholinesterase and butyrylcholinesterase (AChE and BChE) Butyrylcholinesterase (BuChE) | butyrylcholinesterase precursor
Type:
Enzyme
Mol. Mass.:
67776.22
Organism:
Rattus norvegicus (rat)
Description:
Residue:
597
  
Inhibitor
Name:
BDBM8962
Synonyms:
Bis-THA inhibitor 4 N-[5-(1,2,3,4-tetrahydroacridin-9-ylamino)pentyl]-1,2,3,4-tetrahydroacridin-9-amine | Tacrine Dimer 3a
Type:
Small organic molecule
Emp. Form.:
C31H36N4
Mol. Mass.:
464.6443
SMILES:
C(CCNc1c2CCCCc2nc2ccccc12)CCNc1c2CCCCc2nc2ccccc12
: