Target
Squalene monooxygenase
Ligand
BDBM50242262
Substrate
Meas. Tech.
ChEMBL_505336 (CHEMBL947712)
IC50
2000±n/a nM
Citation
 Abe, IKashiwagi, YNoguchi, HTanaka, TIkeshiro, YKashiwada, Y Ellagitannins and hexahydroxydiphenoyl esters as inhibitors of vertebrate squalene epoxidase. J Nat Prod 64:1010-4 (2001)  
Target
Name:
Squalene monooxygenase
Synonyms:
ERG1_RAT SE | Sqle
Type:
PROTEIN
Mol. Mass.:
64038.00
Organism:
Rattus norvegicus
Description:
ChEMBL_505339
Residue:
573
  
Inhibitor
Name:
BDBM50242262
Synonyms:
CHEMBL506204 | PEDUNCULAGIN
Type:
Small organic molecule
Emp. Form.:
C34H24O22
Mol. Mass.:
784.5412
SMILES:
OC1O[C@@H]2COC(=O)c3cc(O)c(O)c(O)c3-c3c(O)c(O)c(O)cc3C(=O)O[C@H]2[C@@H]2OC(=O)c3cc(O)c(O)c(O)c3-c3c(O)c(O)c(O)cc3C(=O)O[C@@H]12
: