Target
Squalene monooxygenase
Ligand
BDBM50377925
Substrate
Meas. Tech.
ChEMBL_505336 (CHEMBL947712)
IC50
12000±n/a nM
Citation
 Abe, IKashiwagi, YNoguchi, HTanaka, TIkeshiro, YKashiwada, Y Ellagitannins and hexahydroxydiphenoyl esters as inhibitors of vertebrate squalene epoxidase. J Nat Prod 64:1010-4 (2001)  
Target
Name:
Squalene monooxygenase
Synonyms:
ERG1_RAT SE | Sqle
Type:
PROTEIN
Mol. Mass.:
64038.00
Organism:
Rattus norvegicus
Description:
ChEMBL_505339
Residue:
573
  
Inhibitor
Name:
BDBM50377925
Synonyms:
CHEBULINIC ACID
Type:
Small organic molecule
Emp. Form.:
C41H32O27
Mol. Mass.:
956.6766
SMILES:
O[C@H]1[C@H]2[C@@H](CC(O)=O)C(=O)O[C@@H]3[C@@H](COC(=O)c4cc(O)c(O)c(O)c4)O[C@@H](OC(=O)c4cc(O)c(O)c(O)c4)[C@H](OC(=O)c4cc(O)c(O)c(OC1=O)c24)[C@H]3OC(=O)c1cc(O)c(O)c(O)c1
: