Target
Squalene monooxygenase
Ligand
BDBM50251008
Substrate
Meas. Tech.
ChEMBL_505339 (CHEMBL947715)
IC50
5400±n/a nM
Citation
 Abe, IKashiwagi, YNoguchi, HTanaka, TIkeshiro, YKashiwada, Y Ellagitannins and hexahydroxydiphenoyl esters as inhibitors of vertebrate squalene epoxidase. J Nat Prod 64:1010-4 (2001)  
Target
Name:
Squalene monooxygenase
Synonyms:
ERG1_RAT SE | Sqle
Type:
PROTEIN
Mol. Mass.:
64038.00
Organism:
Rattus norvegicus
Description:
ChEMBL_505339
Residue:
573
  
Inhibitor
Name:
BDBM50251008
Synonyms:
CHEMBL457687 | Trisnorsqualene difluoromethylidene
Type:
Small organic molecule
Emp. Form.:
C28H44F2
Mol. Mass.:
418.6458
SMILES:
[#6]\[#6](-[#6])=[#6]\[#6]-[#6]\[#6](-[#6])=[#6]\[#6]-[#6]\[#6](-[#6])=[#6]\[#6]-[#6]\[#6]=[#6](/[#6])-[#6]-[#6]\[#6]=[#6](/[#6])-[#6]-[#6]\[#6]=[#6](/F)F
: