Target
Cathepsin B
Ligand
BDBM50157741
Substrate
Meas. Tech.
ChEMBL_508132 (CHEMBL1004869)
IC50
10±n/a nM
Citation
 Méthot, NRubin, JGuay, DBeaulieu, CEthier, DReddy, TJRiendeau, DPercival, MD Inhibition of the activation of multiple serine proteases with a cathepsin C inhibitor requires sustained exposure to prevent pro-enzyme processing. J Biol Chem 282:20836-46 (2007)  
Target
Name:
Cathepsin B
Synonyms:
APP secretase CATB_HUMAN CTSB Cathepsin B light chain | Cathepsin B1
Type:
Enzyme
Mol. Mass.:
37819.69
Organism:
Homo sapiens (Human)
Description:
gi_63102437
Residue:
339
  
Inhibitor
Name:
BDBM50157741
Synonyms:
CHEMBL374508 E64
Type:
Small organic molecule
Emp. Form.:
C15H27N5O5
Mol. Mass.:
357.4054
SMILES:
[#6]-[#6](-[#6])-[#6]-[#6@H](-[#7]-[#6](=O)-[#6@H]-1-[#8]-[#6@@H]-1-[#6](-[#8])=O)-[#6](=O)-[#7]-[#6]-[#6]-[#6]-[#6]\[#7]=[#6](/[#7])-[#7]
: