Target
Solute carrier family 22 member 20
Ligand
BDBM50269986
Substrate
Meas. Tech.
ChEMBL_508178 (CHEMBL1008236)
Ki
182000±n/a nM
Citation
 Kaler, GTruong, DMKhandelwal, ANagle, MEraly, SASwaan, PWNigam, SK Structural variation governs substrate specificity for organic anion transporter (OAT) homologs. Potential remote sensing by OAT family members. J Biol Chem 282:23841-53 (2007)  
Target
Name:
Solute carrier family 22 member 20
Synonyms:
Gm963 S22AK_MOUSE | Slc22a20
Type:
PROTEIN
Mol. Mass.:
60953.19
Organism:
Mus musculus
Description:
ChEMBL_508178
Residue:
556
  
Inhibitor
Name:
BDBM50269986
Synonyms:
3-(4-Hydroxyphenyl)lactate p-Hydroxyphenyllactate
Type:
Small organic molecule
Emp. Form.:
C9H9O4
Mol. Mass.:
181.1659
SMILES:
OC(Cc1ccc(O)cc1)C([O-])=O
: