Target
Solute carrier family 22 member 6
Ligand
BDBM50412192
Substrate
Meas. Tech.
ChEMBL_508179 (CHEMBL1008237)
Ki
56234.13±n/a nM
Citation
 Kaler, GTruong, DMKhandelwal, ANagle, MEraly, SASwaan, PWNigam, SK Structural variation governs substrate specificity for organic anion transporter (OAT) homologs. Potential remote sensing by OAT family members. J Biol Chem 282:23841-53 (2007)  
Target
Name:
Solute carrier family 22 member 6
Synonyms:
Nkt S22A6_MOUSE | Slc22a6
Type:
PROTEIN
Mol. Mass.:
60032.49
Organism:
Mus musculus
Description:
ChEMBL_508179
Residue:
545
  
Inhibitor
Name:
BDBM50412192
Synonyms:
CHEMBL1162486
Type:
Small organic molecule
Emp. Form.:
C8H16O2
Mol. Mass.:
144.2114
SMILES:
CCCC[C@H](CC)C(O)=O
: