Target
Dipeptidyl peptidase 4
Ligand
BDBM50242577
Substrate
Meas. Tech.
ChEMBL_534536 (CHEMBL985439)
IC50
2.4±n/a nM
Citation
 Fukushima, HHiratate, ATakahashi, MMikami, ASaito-Hori, MMunetomo, EKitano, KChonan, SSaito, HSuzuki, ATakaoka, YYamamoto, K Synthesis and structure-activity relationships of potent 4-fluoro-2-cyanopyrrolidine dipeptidyl peptidase IV inhibitors. Bioorg Med Chem 16:4093-106 (2008)  
Target
Name:
Dipeptidyl peptidase 4
Synonyms:
ADABP Adenosine deaminase complexing protein 2 CD_antigen=CD26 DPP4 DPPIV Dipeptidyl peptidase 4 (DPP IV) Dipeptidyl peptidase 4 (DPP4) Dipeptidyl peptidase 4 membrane form Dipeptidyl peptidase IV Dipeptidyl peptidase IV (DDP-IV) Dipeptidyl peptidase IV membrane form Dipeptidyl peptidase-IV (DPP-4) T-cell activation antigen CD26 | TP103
Type:
Enzyme
Mol. Mass.:
88271.01
Organism:
Homo sapiens (Human)
Description:
P27487
Residue:
766
  
Inhibitor
Name:
BDBM50242577
Synonyms:
6-{[2-({2-[(2S,4S)-2-Cyano-4-fluoropyrrolidin-1-yl]-2-oxoethyl}amino)ethyl]amino}nicotinamide | CHEMBL521224
Type:
Small organic molecule
Emp. Form.:
C15H19FN6O2
Mol. Mass.:
334.3488
SMILES:
NC(=O)c1ccc(NCCNCC(=O)N2C[C@@H](F)C[C@H]2C#N)nc1
: