Target
Lysosomal alpha-glucosidase
Ligand
BDBM50234564
Substrate
Meas. Tech.
ChEMBL_551112 (CHEMBL1007693)
IC50
300000±n/a nM
Citation
 Asano, NYamauchi, TKagamifuchi, KShimizu, NTakahashi, STakatsuka, HIkeda, KKizu, HChuakul, WKettawan, AOkamoto, T Iminosugar-producing Thai medicinal plants. J Nat Prod 68:1238-42 (2005)  
Target
Name:
Lysosomal alpha-glucosidase
Synonyms:
70 kDa lysosomal alpha-glucosidase Acid maltase Alpha glucosidase LYAG_HUMAN
Type:
PROTEIN
Mol. Mass.:
105312.45
Organism:
Homo sapiens (Human)
Description:
ChEMBL_1506060
Residue:
952
  
Inhibitor
Name:
BDBM50234564
Synonyms:
CHEMBL259905
Type:
Small organic molecule
Emp. Form.:
C6H13NO4
Mol. Mass.:
163.1717
SMILES:
OC[C@H]1N[C@@H](CO)[C@@H](O)[C@@H]1O
: