Target
Glutamate receptor ionotropic, NMDA 1
Ligand
BDBM50252365
Substrate
Meas. Tech.
ChEMBL_487912 (CHEMBL1015731)
EC50
43000±n/a nM
Citation
 Clausen, RPChristensen, CHansen, KBGreenwood, JRJørgensen, LMicale, NMadsen, JCNielsen, BEgebjerg, JBräuner-Osborne, HTraynelis, SFKristensen, JL N-Hydroxypyrazolyl glycine derivatives as selective N-methyl-D-aspartic acid receptor ligands. J Med Chem 51:4179-87 (2008)  
Target
Name:
Glutamate receptor ionotropic, NMDA 1
Synonyms:
Glutamate (NMDA) receptor subunit zeta 1 Glutamate-NMDA-Channel Glutamate-NMDA-Polyamine NMDA Nmdar1 | phencyclidine
Type:
Enzyme Catalytic Domain
Mol. Mass.:
105533.40
Organism:
RAT
Description:
P35439
Residue:
938
  
Inhibitor
Name:
BDBM50252365
Synonyms:
(R,S)-amino-(1-hydroxy-4-ethyl-pyrazol-3-yl)-acetic acid | CHEMBL506027
Type:
Small organic molecule
Emp. Form.:
C7H11N3O3
Mol. Mass.:
185.1805
SMILES:
CCc1cnn(O)c1C(N)C(O)=O
: