Target
Excitatory amino acid transporter 3
Ligand
BDBM50252049
Substrate
Meas. Tech.
ChEMBL_487935 (CHEMBL1016589)
IC50
3000000±n/a nM
Citation
 Sagot, EJensen, AAPickering, DSPu, XUmberti, MStensbøl, TBNielsen, BAssaf, ZAboab, BBolte, JGefflaut, TBunch, L Chemo-enzymatic synthesis of (2S,4R)-2-amino-4-(3-(2,2-diphenylethylamino)-3-oxopropyl)pentanedioic acid: a novel selective inhibitor of human excitatory amino acid transporter subtype 2. J Med Chem 51:4085-92 (2008)  
Target
Name:
Excitatory amino acid transporter 3
Synonyms:
EAA3_HUMAN EAAT3 HEAAC1 | SLC1A1
Type:
Enzyme Catalytic Domain
Mol. Mass.:
57096.71
Organism:
Homo sapiens (Human)
Description:
Excitatory Amino Acid EAAT3 0 HUMAN::P43005
Residue:
524
  
Inhibitor
Name:
BDBM50252049
Synonyms:
(1S,3R)-1-aminopentane-1,3,5-tricarboxylic acid CHEMBL482081
Type:
Small organic molecule
Emp. Form.:
C8H13NO6
Mol. Mass.:
219.1919
SMILES:
N[C@@H](C[C@@H](CCC(O)=O)C(O)=O)C(O)=O
: