Target
Excitatory amino acid transporter 1
Ligand
BDBM50252050
Substrate
Meas. Tech.
ChEMBL_487936 (CHEMBL1016590)
Ki
>3000000±n/a nM
Citation
 Sagot, EJensen, AAPickering, DSPu, XUmberti, MStensbøl, TBNielsen, BAssaf, ZAboab, BBolte, JGefflaut, TBunch, L Chemo-enzymatic synthesis of (2S,4R)-2-amino-4-(3-(2,2-diphenylethylamino)-3-oxopropyl)pentanedioic acid: a novel selective inhibitor of human excitatory amino acid transporter subtype 2. J Med Chem 51:4085-92 (2008)  
Target
Name:
Excitatory amino acid transporter 1
Synonyms:
EAA1_HUMAN Excitatory Amino Acid EAAT1 GLAST1 | SLC1A3
Type:
Enzyme Catalytic Domain
Mol. Mass.:
59577.19
Organism:
Homo sapiens (Human)
Description:
Excitatory Amino Acid EAAT1 0 HUMAN::P43003
Residue:
542
  
Inhibitor
Name:
BDBM50252050
Synonyms:
(2S,4R)-2-amino-4-(3-amino-3-oxopropyl)pentanedioic acid CHEMBL479804
Type:
Small organic molecule
Emp. Form.:
C8H14N2O5
Mol. Mass.:
218.2072
SMILES:
N[C@@H](C[C@@H](CCC(N)=O)C(O)=O)C(O)=O
: