Target
Glutamate receptor ionotropic, kainate 1
Ligand
BDBM50252051
Substrate
Meas. Tech.
ChEMBL_487956 (CHEMBL1013087)
Ki
3.81±n/a nM
Citation
 Sagot, EPickering, DSPu, XUmberti, MStensbøl, TBNielsen, BChapelet, MBolte, JGefflaut, TBunch, L Chemo-enzymatic synthesis of a series of 2,4-syn-functionalized (S)-glutamate analogues: new insight into the structure-activity relation of ionotropic glutamate receptor subtypes 5, 6, and 7. J Med Chem 51:4093-103 (2008)  
Target
Name:
Glutamate receptor ionotropic, kainate 1
Synonyms:
GRIK1_RAT Glutamate receptor ionotropic kainate 1 Glutamate receptor, ionotropic kainate 1 Grik1
Type:
Enzyme Catalytic Domain
Mol. Mass.:
107860.82
Organism:
RAT
Description:
P22756
Residue:
949
  
Inhibitor
Name:
BDBM50252051
Synonyms:
(2S,4R)-2-amino-4-(3-(methylamino)-3-oxopropyl)pentanedioic acid CHEMBL500042
Type:
Small organic molecule
Emp. Form.:
C9H16N2O5
Mol. Mass.:
232.2337
SMILES:
CNC(=O)CC[C@H](C[C@H](N)C(O)=O)C(O)=O
: