Target
Glutamate receptor ionotropic, kainate 1
Ligand
BDBM50252103
Substrate
Meas. Tech.
ChEMBL_487956 (CHEMBL1013087)
Ki
1.11±n/a nM
Citation
 Sagot, EPickering, DSPu, XUmberti, MStensbøl, TBNielsen, BChapelet, MBolte, JGefflaut, TBunch, L Chemo-enzymatic synthesis of a series of 2,4-syn-functionalized (S)-glutamate analogues: new insight into the structure-activity relation of ionotropic glutamate receptor subtypes 5, 6, and 7. J Med Chem 51:4093-103 (2008)  
Target
Name:
Glutamate receptor ionotropic, kainate 1
Synonyms:
GRIK1_RAT Glutamate receptor ionotropic kainate 1 Glutamate receptor, ionotropic kainate 1 Grik1
Type:
Enzyme Catalytic Domain
Mol. Mass.:
107860.82
Organism:
RAT
Description:
P22756
Residue:
949
  
Inhibitor
Name:
BDBM50252103
Synonyms:
(2S,3S,4S)-2-CARBOXY-4-[(1Z,3E,5R)-5-CARBOXY-1-METHYL-1,3-HEXADIENYL]-3-PYRROLIDINEACETIC ACID domoic acid | domoric acid
Type:
Small organic molecule
Emp. Form.:
C15H21NO6
Mol. Mass.:
311.3303
SMILES:
C[C@H](\C=C\C=C(/C)[C@H]1CN[C@@H]([C@H]1CC(O)=O)C(O)=O)C(O)=O
: