Target
Cannabinoid receptor 2
Ligand
BDBM50180022
Substrate
Meas. Tech.
ChEMBL_490517 (CHEMBL981123)
Ki
5.4±n/a nM
Citation
 Urbani, PCascio, MGRamunno, ABisogno, TSaturnino, CDi Marzo, V Novel sterically hindered cannabinoid CB1 receptor ligands. Bioorg Med Chem 16:7510-5 (2008)  
Target
Name:
Cannabinoid receptor 2
Synonyms:
CANNABINOID CB2 CB2 CB2B CNR2_HUMAN Cannabinoid CB2 receptor Cannabinoid receptor 2 (CB2R) | hCB2
Type:
G Protein-Coupled Receptor (GPCR)
Mol. Mass.:
39690.94
Organism:
Homo sapiens (Human)
Description:
P34972
Residue:
360
  
Inhibitor
Name:
BDBM50180022
Synonyms:
5-(4-chloro-3-methyl-phenyl)-1-(4-methyl-benzyl)-1H-pyrazole-3-carboxylic acid (1,3,3-trimethyl-bicyclo[2.2.1]hept-2-yl)-amide | CHEMBL381689
Type:
Small organic molecule
Emp. Form.:
C29H34ClN3O
Mol. Mass.:
476.053
SMILES:
Cc1ccc(Cn2nc(cc2-c2ccc(Cl)c(C)c2)C(=O)NC2C3(C)CCC(C3)C2(C)C)cc1
: