Target
Sucrase-isomaltase, intestinal
Ligand
BDBM50263044
Substrate
Meas. Tech.
ChEMBL_490824 (CHEMBL993563)
IC50
160±n/a nM
Citation
 Kuriyama, CKamiyama, OIkeda, KSanae, FKato, AAdachi, IImahori, TTakahata, HOkamoto, TAsano, N In vitro inhibition of glycogen-degrading enzymes and glycosidases by six-membered sugar mimics and their evaluation in cell cultures. Bioorg Med Chem 16:7330-6 (2008)  
Target
Name:
Sucrase-isomaltase, intestinal
Synonyms:
SUIS_RAT Sucrase-isomaltase | alpha-Glucosidase (α-Glucosidase)
Type:
Enzyme
Mol. Mass.:
210329.04
Organism:
Rattus norvegicus (Rat)
Description:
P23739
Residue:
1841
  
Inhibitor
Name:
BDBM50263044
Synonyms:
CHEMBL476960 | Voglibose
Type:
Small organic molecule
Emp. Form.:
C10H21NO7
Mol. Mass.:
267.2762
SMILES:
OCC(CO)N[C@H]1C[C@](O)(CO)[C@@H](O)[C@H](O)[C@H]1O
: