Target
Histone-arginine methyltransferase CARM1
Ligand
BDBM50262871
Substrate
Meas. Tech.
ChEMBL_490632 (CHEMBL984753)
IC50
160±n/a nM
Citation
 Purandare, AVChen, ZHuynh, TPang, SGeng, JVaccaro, WPoss, MAOconnell, JNowak, KJayaraman, L Pyrazole inhibitors of coactivator associated arginine methyltransferase 1 (CARM1). Bioorg Med Chem Lett 18:4438-41 (2008)  
Target
Name:
Histone-arginine methyltransferase CARM1
Synonyms:
CARM1 Coactivator-associated arginine methyltransferase 1 PRMT4 Protein arginine methyltransferase 4 (PRMT4)
Type:
Protein
Mol. Mass.:
65855.47
Organism:
Homo sapiens (Human)
Description:
Q86X55
Residue:
608
  
Inhibitor
Name:
BDBM50262871
Synonyms:
2-{3-[((S)-2-Amino-propionylamino)-methyl]-phenyl}-5-trifluoromethyl-2H-pyrazole-3-carboxylic acid (3-fluoro-2'-methanesulfonyl-biphenyl-4-yl)-amide | CHEMBL501950
Type:
Small organic molecule
Emp. Form.:
C28H25F4N5O4S
Mol. Mass.:
603.588
SMILES:
C[C@H](N)C(=O)NCc1cccc(c1)-n1nc(cc1C(=O)Nc1ccc(cc1F)-c1ccccc1S(C)(=O)=O)C(F)(F)F
: