Target
Liver carboxylesterase 1
Ligand
BDBM50204493
Substrate
Meas. Tech.
ChEMBL_513868 (CHEMBL970762)
IC50
20±n/a nM
Citation
 Garfunkle, JEzzili, CRayl, TJHochstatter, DGHwang, IBoger, DL Optimization of the central heterocycle of alpha-ketoheterocycle inhibitors of fatty acid amide hydrolase. J Med Chem 51:4392-403 (2008)  
Target
Name:
Liver carboxylesterase 1
Synonyms:
Acyl coenzyme A:cholesterol acyltransferase CES1 EST1_HUMAN Serine hydrolase (CES1)
Type:
Protein
Mol. Mass.:
62520.83
Organism:
Homo sapiens (Human)
Description:
Residue:
567
  
Inhibitor
Name:
BDBM50204493
Synonyms:
1-(oxazol-2-yl)-7-phenylheptan-1-one | CHEMBL220125
Type:
Small organic molecule
Emp. Form.:
C16H19NO2
Mol. Mass.:
257.3276
SMILES:
O=C(CCCCCCc1ccccc1)c1ncco1
: