Target
Neutral cholesterol ester hydrolase 1
Ligand
BDBM50262188
Substrate
Meas. Tech.
ChEMBL_513867 (CHEMBL970761)
IC50
25000±n/a nM
Citation
 Garfunkle, JEzzili, CRayl, TJHochstatter, DGHwang, IBoger, DL Optimization of the central heterocycle of alpha-ketoheterocycle inhibitors of fatty acid amide hydrolase. J Med Chem 51:4392-403 (2008)  
Target
Name:
Neutral cholesterol ester hydrolase 1
Synonyms:
AADACL1 NCEH1 | NCEH1_HUMAN
Type:
PROTEIN
Mol. Mass.:
45810.81
Organism:
Homo sapiens (Human)
Description:
ChEMBL_835312
Residue:
408
  
Inhibitor
Name:
BDBM50262188
Synonyms:
1-(1,2,4-Oxadiazol-5-yl)-7-phenylheptan-1-one | CHEMBL448922
Type:
Small organic molecule
Emp. Form.:
C15H18N2O2
Mol. Mass.:
258.3156
SMILES:
O=C(CCCCCCc1ccccc1)c1ncno1
: