Target
Ectonucleoside triphosphate diphosphohydrolase 8
Ligand
BDBM50262373
Substrate
Meas. Tech.
ChEMBL_514295 (CHEMBL979125)
Ki
255000±n/a nM
Citation
 Brunschweiger, AIqbal, JUmbach, FScheiff, ABMunkonda, MNSévigny, JKnowles, AFMüller, CE Selective nucleoside triphosphate diphosphohydrolase-2 (NTPDase2) inhibitors: nucleotide mimetics derived from uridine-5'-carboxamide. J Med Chem 51:4518-28 (2008)  
Target
Name:
Ectonucleoside triphosphate diphosphohydrolase 8
Synonyms:
ENTP8_HUMAN | ENTPD8
Type:
PROTEIN
Mol. Mass.:
53895.40
Organism:
Homo sapiens (Human)
Description:
ChEMBL_514295
Residue:
495
  
Inhibitor
Name:
BDBM50262373
Synonyms:
4-[4-((2S,3R,4S,5R)-5-(6-Amino-9H-purin-9-yl)-3,4-dihydroxytetrahydrofurane-2-carboxamido)butylamido]benzylphosphonic acid diethyl ester | CHEMBL464548
Type:
Small organic molecule
Emp. Form.:
C25H34N7O8P
Mol. Mass.:
591.5533
SMILES:
CCOP(=O)(Cc1ccc(NC(=O)CCCNC(=O)[C@H]2O[C@H]([C@H](O)[C@@H]2O)n2cnc3c(N)ncnc23)cc1)OCC
: