Target
Adenosine receptor A1
Ligand
BDBM21173
Substrate
Meas. Tech.
ChEMBL_509567 (CHEMBL1000453)
Ki
6.1±n/a nM
Citation
 Mantri, Mde Graaf, Ovan Veldhoven, JGöblyös, Avon Frijtag Drabbe Künzel, JKMulder-Krieger, TLink, Rde Vries, HBeukers, MWBrussee, JIjzerman, AP 2-Amino-6-furan-2-yl-4-substituted nicotinonitriles as A2A adenosine receptor antagonists. J Med Chem 51:4449-55 (2008)  
Target
Name:
Adenosine receptor A1
Synonyms:
A1 adenosine receptor (hA1) AA1R_HUMAN ADORA1 Adenosine A1-receptor Adenosine receptor A1 (hA1) | Adenosine transporter (AdT)
Type:
G Protein-Coupled Receptor (GPCR)
Mol. Mass.:
36520.92
Organism:
Homo sapiens (Human)
Description:
P30542
Residue:
326
  
Inhibitor
Name:
BDBM21173
Synonyms:
1,3-dipropyl-8-cyclopentylxanthine CHEMBL183 PD116948 | [3H]DPCPX
Type:
radiolabeled ligand
Emp. Form.:
C16H24N4O2
Mol. Mass.:
304.3874
SMILES:
CCCn1c2nc([nH]c2c(=O)n(CCC)c1=O)C1CCCC1
: