Target
Kappa-type opioid receptor
Ligand
BDBM50261791
Substrate
Meas. Tech.
ChEMBL_513622 (CHEMBL970713)
Ki
52±n/a nM
Citation
 Sakami, SMaeda, MKawai, KAoki, TKawamura, KFujii, HHasebe, KNakajima, MEndo, TUeno, SIto, TKamei, JNagase, H Structure-antitussive activity relationships of naltrindole derivatives. Identification of novel and potent antitussive agents. J Med Chem 51:4404-11 (2008)  
Target
Name:
Kappa-type opioid receptor
Synonyms:
Kappa Opioid Receptor OPRK1 Opiate Kappa 1 | mu/kappa opioid receptor
Type:
G Protein-Coupled Receptor (GPCR)
Mol. Mass.:
42744.99
Organism:
Cavia porcellus (domestic guinea pig)
Description:
P41144
Residue:
380
  
Inhibitor
Name:
BDBM50261791
Synonyms:
(5R,9R,13S,14S)-17-Cyclopropylmethyl-6,7-didehydro-4,5-epoxy-6',7',8',9'-tetrahydro-1'H-benzo[g]indolo[2',3':6,7]morphinan-3,14-diol | CHEMBL469046
Type:
Small organic molecule
Emp. Form.:
C30H32N2O3
Mol. Mass.:
468.5867
SMILES:
Oc1ccc2C[C@H]3N(CC4CC4)CC[C@@]45[C@@H](Oc1c24)c1[nH]c2c4CCCCc4ccc2c1C[C@@]35O
: