Target
Acetylcholinesterase
Ligand
BDBM50262340
Substrate
Meas. Tech.
ChEMBL_514381 (CHEMBL967995)
IC50
670±n/a nM
Citation
 León, Rde los Ríos, CMarco-Contelles, JHuertas, OBarril, XLuque, FJLópez, MGGarcía, AGVillarroya, M New tacrine-dihydropyridine hybrids that inhibit acetylcholinesterase, calcium entry, and exhibit neuroprotection properties. Bioorg Med Chem 16:7759-69 (2008)  
Target
Name:
Acetylcholinesterase
Synonyms:
ACES_HUMAN Acetylcholinesterase (AChE) | Acetylcholinesterase (human AChE)
Type:
Enzyme
Mol. Mass.:
67792.70
Organism:
Homo sapiens (Human)
Description:
P22303
Residue:
614
  
Inhibitor
Name:
BDBM50262340
Synonyms:
11-Amino-3,3-dimethyl-12-p-tolyl-3,4,5,7,8,9,10,12-octahydro-2H-dibenzo[b,g][1,8]naphthyridin-1-one | CHEMBL513161
Type:
Small organic molecule
Emp. Form.:
C25H29N3O
Mol. Mass.:
387.5173
SMILES:
Cc1ccc(cc1)C1C2C(=O)CC(C)(C)CC2=Nc2nc3CCCCc3c(N)c12
: