Target
Galectin-3
Ligand
BDBM50272258
Substrate
Meas. Tech.
ChEMBL_510248 (CHEMBL1008161)
IC50
>5000000±n/a nM
Citation
 Giguère, DBonin, MACloutier, PPatnam, RSt-Pierre, CSato, SRoy, R Synthesis of stable and selective inhibitors of human galectins-1 and -3. Bioorg Med Chem 16:7811-23 (2008)  
Target
Name:
Galectin-3
Synonyms:
LEG3_HUMAN MAC2
Type:
Enzyme
Mol. Mass.:
26156.54
Organism:
Homo sapiens (Human)
Description:
P17931
Residue:
250
  
Inhibitor
Name:
BDBM50272258
Synonyms:
(2R,3R,4R,5R,6S)-2-(hydroxymethyl)-6-(2-(3-nitrophenyl)allyl)-tetrahydro-2H-pyran-3,4,5-triol | CHEMBL524323
Type:
Small organic molecule
Emp. Form.:
C15H19NO7
Mol. Mass.:
325.3139
SMILES:
OC[C@H]1O[C@@H](CC(=C)c2cccc(c2)[N+]([O-])=O)[C@H](O)[C@@H](O)[C@H]1O
: