Target
Galectin-3
Ligand
BDBM50272301
Substrate
Meas. Tech.
ChEMBL_510248 (CHEMBL1008161)
IC50
2500000±n/a nM
Citation
 Giguère, DBonin, MACloutier, PPatnam, RSt-Pierre, CSato, SRoy, R Synthesis of stable and selective inhibitors of human galectins-1 and -3. Bioorg Med Chem 16:7811-23 (2008)  
Target
Name:
Galectin-3
Synonyms:
LEG3_HUMAN MAC2
Type:
Enzyme
Mol. Mass.:
26156.54
Organism:
Homo sapiens (Human)
Description:
P17931
Residue:
250
  
Inhibitor
Name:
BDBM50272301
Synonyms:
5-(beta-D-Galactopyranosyl)-4-methyl-2-(2,5-dibromophenyl)sulfonylaminothiazole | CHEMBL499071
Type:
Small organic molecule
Emp. Form.:
C17H20Br2N2O7S2
Mol. Mass.:
588.288
SMILES:
Cc1nc(NS(=O)(=O)c2cc(Br)ccc2Br)sc1C[C@@H]1O[C@H](CO)[C@H](O)[C@H](O)[C@H]1O
: