Target
Cone cGMP-specific 3',5'-cyclic phosphodiesterase subunit alpha'
Ligand
BDBM50272529
Substrate
Meas. Tech.
ChEMBL_510819 (CHEMBL998838)
IC50
30900±n/a nM
Citation
 Dell'Agli, MGalli, GVDal Cero, EBelluti, FMatera, RZironi, EPagliuca, GBosisio, E Potent inhibition of human phosphodiesterase-5 by icariin derivatives. J Nat Prod 71:1513-7 (2008)  
Target
Name:
Cone cGMP-specific 3',5'-cyclic phosphodiesterase subunit alpha'
Synonyms:
3',5'-cyclic phosphodiesterase PDE6C_HUMAN Phosphodiesterase 6C | Phosphodiesterase 6C (PDE6C)
Type:
Protein
Mol. Mass.:
99132.02
Organism:
Homo sapiens (Human)
Description:
P51160
Residue:
858
  
Inhibitor
Name:
BDBM50272529
Synonyms:
3,7-Bis(2-hydroxyethyl)icaritin | CHEMBL498486
Type:
Small organic molecule
Emp. Form.:
C25H28O8
Mol. Mass.:
456.485
SMILES:
[#6]-[#8]-c1ccc(cc1)-c1oc2c(-[#6]\[#6]=[#6](\[#6])-[#6])c(-[#8]-[#6]-[#6]-[#8])cc(-[#8])c2c(=O)c1-[#8]-[#6]-[#6]-[#8]
: